{"text_format":"1","workbook":"xlsx","n_sheets":8,"sheets":["LibroCódigos","I TRIMESTRE","II TRIMESTRE","III TRIMESTRE","IV TRIMESTRE","REPORTES XXXXX","Datos","PSTIG-PIOEG"],"not_rendered":{"charts":0,"images":0,"macros":0,"external_links":0,"defined_names":82,"comments":8,"pivot_tables":0},"unopened":[],"bounds":{"document_bytes":16777216,"sheet_cells":100000,"rows_first":2000,"rows_last":500,"rows_between":2000,"halvings":0,"cell_chars":16384,"cell_head_chars":4096},"cells_cut":0,"cells_raw":0,"read":"whole","date_system":"1900"}

{"sheet":"LibroCódigos","index":0,"n_rows":100,"n_cols":6,"rows_kept":100,"cut":false,"hidden":true,"merged":[]}
["PRODUCTOS","PROCESO/DERECHO","DIMENSIÓN/CATEGORÍA","CATEGORÍA/ACCIÓN","ACTIVIDADES","CÓDIGO"]
["PSTIG","MISIONALES ","MISIONALIDAD_DE_LA_ENTIDAD","Directrices de los sectores al nivel local sobre aplicación de criterios de viabilidad y elegibilidad de planes, programas y proyectos con los enfoques de género y diferencial","Implementar un piloto de circuito de cuidado con enfoque territorial, diferencial y de género dirigida a los actores viales que usan modos de transportes sostenible, específicamente de los modos peatonal y en bicicleta en el entorno de un colegio de Bogotá.",{"$f":"IF(D2=0,\" \",IFERROR(VLOOKUP(D2,'PSTIG-PIOEG'!$G$2:H132,2,FALSE),\"Error\"))","v":"PSTIG-3-1A"}]
["PIOEG","VIOLENCIAS",null,null,"Aplicar una encuesta dirigida a usuarias y usuarios de taxis para identificar temas de percepción de seguridad, de calidad del servicio y acciones de discriminación, en el marco de la estrategia \"Taxistas en equidad\".",{"$f":"IF(D3=0,\" \",IFERROR(VLOOKUP(D3,'PSTIG-PIOEG'!$G$2:H133,2,FALSE),\"Error\"))","v":" "}]
["PSTIG","MISIONALES ","MISIONALIDAD_DE_LA_ENTIDAD","Implementación y ejecución de planes, programas y proyectos con los enfoques de género y diferencial.","Implementar una estrategia integral para el mejoramiento de la experiencia de viaje y seguridad de las mujeres usuarias y prestadoras del servicio del transporte público individual.",{"$f":"IF(D4=0,\" \",IFERROR(VLOOKUP(D4,'PSTIG-PIOEG'!$G$2:H134,2,FALSE),\"Error\"))","v":"PSTIG-3-1B"}]
["PSTIG","MISIONALES ","MISIONALIDAD_DE_LA_ENTIDAD","Implementación y ejecución de planes, programas y proyectos con los enfoques de género y diferencial.","Diseñar un plan de acción en el marco de los resultados de la consultoría \"Caracterizar los viajes de cuidado con enfoque diferencial y de género a partir de cartografía etnográfica\"",{"$f":"IF(D5=0,\" \",IFERROR(VLOOKUP(D5,'PSTIG-PIOEG'!$G$2:H135,2,FALSE),\"Error\"))","v":"PSTIG-3-1B"}]
["PIOEG","VIOLENCIAS",null,null,"Implementar una estrategia que transversalice el enfoque de género en el Centro de Orientación de Víctimas de Siniestros Viales",{"$f":"IF(D6=0,\" \",IFERROR(VLOOKUP(D6,'PSTIG-PIOEG'!$G$2:H136,2,FALSE),\"Error\"))","v":" "}]
{"$rows_left_out":95}
{"sheet":"I TRIMESTRE","index":1,"n_rows":96,"n_cols":18,"rows_kept":96,"cut":false,"hidden":false,"merged":[[2,1,2,2],[0,3,2,7]]}
["Decreto xxx de 2021"]
["Conpes 014 de 2020"]
["Sector","Movilidad"]
["Entidad","Código","Actividades","Indicador","Meta 2021","Fecha inicio","Fecha finalización","Avance meta I Trimestre","DESCRIPCIÓN AVANCE CUALITATIVO I TRIMESTRE","¿Se cumplió la actividad?","# Mujeres","# Hombres","Descripción de diversidades y diferencias","OBSERVACIONES","Dirección/Subdirección/Grupo/Unidad","Persona de contacto","Teléfono","Correo electrónico"]
["11.1 Secretaría Distrital de Movilidad ",{"$f":"IF(C5=0,\" \",IFERROR(VLOOKUP(C5,LibroCódigos!$E$2:$F$2571,2,FALSE),\"ERROR\"))","v":" "},"Aplicar una encuesta dirigida a usuarias y usuarios de taxis para identificar temas de percepción de seguridad, de calidad del servicio y acciones de discriminación, en el marco de la estrategia \"Taxistas en equidad\".","Encuesta diferenciada con enfoque de género de las condiciones de prestación de servicio de taxis en Bogotá aplicada. ",1,"2021-06-01","2021-11-30",0.4,"El objetivo de esta encuesta es conocer la percepción de las y los usuarios de taxi sobre el servicio y tener en cuenta dicha percepción en la construcción del “modelo de calidad” del servicio. Se inició la organización de la información levantada en la encuesta realizada en diciembre de 2020, logrando un análisis general de datos gruesos recogidos de 414 personas usuarias del servicio de taxi, quienes calificaron diferentes aspectos del servicio, expresaron los criterios que consideran dan calidad al servicio y opinaron sobre aspectos de seguridad en este modo de transporte.\nDe los resultados se destaca: (i) las y los encuestados en su mayoría consideran que debe haber más mujeres conductoras, lo cual se podría entender como un factor de confianza para las usuarias, (ii) las y los usuarios de taxi que respondieron la encuesta perciben el género como la segunda causa de discriminación, siendo la discapacidad la primera.   \nEstos resultados se tendrán en cuenta en la toma de decisiones, actividades y estrategias para la mejora del servicio de taxi.","si",252,162,"La encuesta se respondió en un 61% por mujeres quienes al igual que los hombres manifestaron ser usuarias regulares del servicio de taxi. El rango de edad más representativo, con 23% de participación fue usuarias y usuarios entre 35 y 44 años, seguido con un 22% por personas entre 25 y 34 años. Las personas entre 45 y 54 constituyen el 20% de las encuestas, al igual que las de 55 y más años y las que tienen entre 18 y 24 son el menor numero de participantes, con un 15%.  En cuanto al estrato social, la mayoría, el 56% de personas encuestadas se identificaron como estrato 3 y 4, solo un 8% se identifico de estrato 1 o 2 y el 36% ","Con los resultados de la encuesta se podrán ajustar las estrategias para impulsar un mejor servicio y que prestadoras y usarías tengan una mejor experiencia de viaje. Está pendiente la desagregación de los resultados para examinar y diferenciar en detalle las percepciones del servicio por sexo. Igualmente está previsto para próximos meses someter a discusión las preguntas de la encuesta, con diferentes áreas de la SDM, para su retroalimentación con el objetivo de incluir en una próxima versión las preguntas más enfocadas en temas de género y que responsan a las necesidades de las mujeres. \nSobre la actividad concertada se observa que se modificó el indicador, la SDM no comparte el cambio y solicita mantener lo concertado, que era: Encuesta aplicada a usuarias y usuarios de taxis para identificar temas de percepción de seguridad, de calidad del servicio y acciones de discriminación, en el marco de la estrategia.  También se detectó cambio en la fecha de inicio por lo cual se solicita corregir, es 1/01/2021","Subdirección de transporte público","Claudia Mercado",null,"cmercado@movilidad.gov.co"]
["11.1 Secretaría Distrital de Movilidad ",{"$f":"IF(C6=0,\" \",IFERROR(VLOOKUP(C6,LibroCódigos!$E$2:$F$2571,2,FALSE),\"ERROR\"))","v":"PSTIG-3-1B"},"Implementar una estrategia integral para el mejoramiento de la experiencia de viaje y seguridad de las mujeres usuarias y prestadoras del servicio del transporte público individual.","Estrategia integral con enfoque territorial, diferencial y de género que identifique la experiencia de viaje de las mujeres usuarias y prestadoras del servicio del transporte público individual implementada. ",1,"2021-06-01","2021-12-30",null,null,null,null,null,null,"Excluir de la concertación, duplicada en Plan de acción","Subdirección de transporte público","Claudia Mercado",null,"cmercado@movilidad.gov.co"]
{"$rows_left_out":91}
{"sheet":"II TRIMESTRE","index":2,"n_rows":94,"n_cols":18,"rows_kept":94,"cut":false,"hidden":false,"merged":[[0,3,2,7],[2,1,2,2]]}
["Decreto xxx de 2021"]
["Conpes 014 de 2020"]
["Sector","Movilidad"]
["Entidad","Código","Actividades","Indicador","Meta 2021","Fecha inicio","Fecha finalización","Avance meta II Trimestre","DESCRIPCIÓN AVANCE CUALITATIVO II TRIMESTRE","¿Se cumplió la actividad?","# Mujeres","# Hombres","Descripción de diversidades y diferencias","OBSERVACIONES","Dirección/Subdirección/Grupo/Unidad","Persona de contacto","Teléfono","Correo electrónico"]
["11.1 Secretaría Distrital de Movilidad ",{"$f":"IF(C5=0,\" \",IFERROR(VLOOKUP(C5,LibroCódigos!$E$2:$F$2571,2,FALSE),\"ERROR\"))","v":" "},"Aplicar una encuesta dirigida a usuarias y usuarios de taxis para identificar temas de percepción de seguridad, de calidad del servicio y acciones de discriminación, en el marco de la estrategia \"Taxistas en equidad\".","Encuesta diferenciada con enfoque de género de las condiciones de prestación de servicio de taxis en Bogotá aplicada. ",1,"2021-06-01","2021-11-30",0.3,"En el segundo trimestre se avanzó en la organización de los datos, logrando desagregar por sexo, edad y estrato social las repuestas a las diferentes preguntas y organizar una tabla con esta información.  Se proyecta identificar dos o tres preguntas clave para hacer un análisis desde la perspectiva de género y aportar así a la construcción del modelo de calidad.\n\nLa actividad está pensada en tres pasos (i) aplicación de la encuesta y análisis de datos gruesos, (ii) desagregación de datos por sexo y (iii) análisis desde la perspectiva de género de preguntas seleccionadas. El primer paso se le asigno un peso de 0,4 y los pasos dos y tres tiene un peso de 0,3 cada uno.  \n\n","si",252,162,"La encuesta se respondió en un 61% por mujeres quienes al igual que los hombres manifestaron ser usuarias regulares del servicio de taxi. El rango de edad más representativo, con 23% de participación fue usuarias y usuarios entre 35 y 44 años, seguido con un 22% por personas entre 25 y 34 años. Las personas entre 45 y 54 constituyen el 20% de las encuestas, al igual que las de 55 y más años y las que tienen entre 18 y 24 son el menor numero de participantes, con un 15%.  En cuanto al estrato social, la mayoría, el 56% de personas encuestadas se identificaron como estrato 3 y 4, solo un 8% se identifico de estrato 1 o 2 y el 36% ","Sobre la actividad concertada se observa que se modificó el indicador, la SDM no comparte el cambio y solicita mantener lo concertado, que era: Encuesta aplicada a usuarias y usuarios de taxis para identificar temas de percepción de seguridad, de calidad del servicio y acciones de discriminación, en el marco de la estrategia.  También se detectó cambio en la fecha de inicio por lo cual se solicita corregir, es 1/01/2021\n\nSDMujer: En cuanto al reporte cualitativo, puede ser util uncluir los aspectos metodológicos descritos en las observaciones, así como los elementos diferenciales y de género que se consideraron para las preguntas clave mencionadas. Así mismo, para el reporte es necesario dar contexto frente a las acciones del 2020 y el plan de trabajo que permita establecer la trazabilidad de las acciones relacionadas en el reporte. \n","Subdirección de transporte público","Claudia Mercado",null,"cmercado@movilidad.gov.co"]
["11.1 Secretaría Distrital de Movilidad ",{"$f":"IF(C6=0,\" \",IFERROR(VLOOKUP(C6,LibroCódigos!$E$2:$F$2571,2,FALSE),\"ERROR\"))","v":"PSTIG-3-1B"},"Diseñar un plan de acción en el marco de los resultados de la consultoría \"Caracterizar los viajes de cuidado con enfoque diferencial y de género a partir de cartografía etnográfica\"","Plan de acción con caracterización de los viajes de cuidado con enfoque diferencial y de género a partir de cartografía etnográfica diseñado. ",1,"2021-06-01","2021-07-01",null,"SDMujer: Se encuentra en revisión, se eleva la consulta para definir qué hacer. ",null,null,null,null,"Se reitera solicitud de excluir de la concertación. En el plan de acción de la Política la SDM tiene el producto 11.1.9 Estrategia de participación con enfoque de género en el sistema distrital del cuidado. La estrategia está compuesta por dos tipos de acciones para su implementación, a saber, Acciones de gestión intersectorial con el Sistema Distrital de Cuidado y Procesos de articulación para la estrategia de participación. Como parte de las acciones de gestión intersectorial con el SIDICU, se definió el desarrollo de la consultoría  \"Caracterizar los viajes de cuidado con enfoque diferencial y de género a partir de cartografía etnográfica\", por lo cual en segundo semestre el reporte sobre esta consultoría se duplicaría en el instrumento de plan de acción. \n\nDMujer: Se encuentra en revisión, se eleva la consulta para definir qué hacer. ","Oficina de Gestión Social","Adriana Iza",3103049546,"aiza@movilidad.gov.co"]
{"$rows_left_out":89}
{"sheet":"III TRIMESTRE","index":3,"n_rows":94,"n_cols":18,"rows_kept":94,"cut":false,"hidden":false,"merged":[[0,3,2,7],[2,1,2,2]]}
["Decreto xxx de 2021"]
["Conpes 014 de 2020"]
["Sector","Movilidad"]
["Entidad","Código","Actividades","Indicador","Meta 2021","Fecha inicio","Fecha finalización","Avance meta III Trimestre","DESCRIPCIÓN AVANCE CUALITATIVO II TRIMESTRE","¿Se cumplió la actividad?","# Mujeres","# Hombres","Descripción de diversidades y diferencias","OBSERVACIONES","Dirección/Subdirección/Grupo/Unidad","Persona de contacto","Teléfono","Correo electrónico"]
["11.1 Secretaría Distrital de Movilidad ",{"$f":"IF(C5=0,\" \",IFERROR(VLOOKUP(C5,LibroCódigos!$E$2:$F$2571,2,FALSE),\"ERROR\"))","v":" "},"Aplicar una encuesta dirigida a usuarias y usuarios de taxis para identificar temas de percepción de seguridad, de calidad del servicio y acciones de discriminación, en el marco de la estrategia \"Taxistas en equidad\".","Encuesta diferenciada con enfoque de género de las condiciones de prestación de servicio de taxis en Bogotá aplicada. ",1,"2021-06-01","2021-11-30",0.3,"En el tercer trimestre se avanzó en la selección de factores, atributos y citerios que perciben los usuarios y usuarias de taxi, teniendo como fuente de información la encuesta aplicada a usuarios en 2020, taller visión del taxi 2021, normas técnicas y legales y un benchamarking detallado. En esta selección de factores, atributos y criterios se tuvieron en cuenta los atributos de seguridad ciudadana desde la perspectiva de las mujeres al abordar un vehículo taxi y el comportamiento de los conductores. Se  proyecta para el siguiente trimestre realizar talleres con conductoras de taxi y usuarios, para posteriormente diseñar la encuesta e uncluir preguntas clave para hacer un análisis desde la perspectiva de género.\n\nLa actividad  concertada está pensada en tres pasos (i) aplicación de la encuesta y análisis de datos gruesos, realizado en primer trimestre (ii) desagregación de datos por sexo, cumplido el trimestres anterior y (iii) análisis desde la perspectiva de género de preguntas seleccionadas, cumplido en el periodo de reporte. El primer paso se le asigno un peso de 0,4 y los pasos dos y tres tiene un peso de 0,3 cada uno.  ","SI",252,162,"La encuesta se respondió en un 61% por mujeres quienes al igual que los hombres manifestaron ser usuarias regulares del servicio de taxi. El rango de edad más representativo, con 23% de participación fue usuarias y usuarios entre 35 y 44 años, seguido con un 22% por personas entre 25 y 34 años. Las personas entre 45 y 54 constituyen el 20% de las encuestas, al igual que las de 55 y más años y las que tienen entre 18 y 24 son el menor numero de participantes, con un 15%.  En cuanto al estrato social, la mayoría, el 56% de personas encuestadas se identificaron como estrato 3 y 4, solo un 8% se identifico de estrato 1 o 2 y el 36% ",null,"Subdirección de transporte público","Claudia Mercado",null,"cmercado@movilidad.gov.co"]
["11.1 Secretaría Distrital de Movilidad ",{"$f":"IF(C6=0,\" \",IFERROR(VLOOKUP(C6,LibroCódigos!$E$2:$F$2571,2,FALSE),\"ERROR\"))","v":"PSTIG-3-1B"},"Diseñar un plan de acción en el marco de los resultados de la consultoría \"Caracterizar los viajes de cuidado con enfoque diferencial y de género a partir de cartografía etnográfica\"","Plan de acción con caracterización de los viajes de cuidado con enfoque diferencial y de género a partir de cartografía etnográfica diseñado. ",1,"2021-06-01","2021-07-01",null,null,null,null,null,null,"Se reitera solicitud de excluir de la concertación. En el plan de acción de la Política la SDM tiene el producto 11.1.9 Estrategia de participación con enfoque de género en el sistema distrital del cuidado. La estrategia está compuesta por dos tipos de acciones para su implementación, a saber, Acciones de gestión intersectorial con el Sistema Distrital de Cuidado y Procesos de articulación para la estrategia de participación. Como parte de las acciones de gestión intersectorial con el SIDICU, se definió el desarrollo de la consultoría  \"Caracterizar los viajes de cuidado con enfoque diferencial y de género a partir de cartografía etnográfica\", por lo cual en segundo semestre el reporte sobre esta consultoría se duplicaría en el instrumento de plan de acción. ","Oficina de Gestión Social","Adriana Iza",3103049546,"aiza@movilidad.gov.co"]
{"$rows_left_out":89}
{"sheet":"IV TRIMESTRE","index":4,"n_rows":94,"n_cols":18,"rows_kept":94,"cut":false,"hidden":false,"merged":[[0,3,2,7],[2,1,2,2]]}
["Decreto xxx de 2021"]
["Conpes 014 de 2020"]
["Sector","Movilidad"]
["Entidad","Código","Actividades","Indicador","Meta 2021","Fecha inicio","Fecha finalización","Avance meta IV Trimestre","DESCRIPCIÓN AVANCE CUALITATIVO II TRIMESTRE","¿Se cumplió la actividad?","# Mujeres","# Hombres","Descripción de diversidades y diferencias","OBSERVACIONES","Dirección/Subdirección/Grupo/Unidad","Persona de contacto","Teléfono","Correo electrónico"]
["11.1 Secretaría Distrital de Movilidad ",{"$f":"IF(C5=0,\" \",IFERROR(VLOOKUP(C5,LibroCódigos!$E$2:$F$2571,2,FALSE),\"ERROR\"))","v":" "},"Aplicar una encuesta dirigida a usuarias y usuarios de taxis para identificar temas de percepción de seguridad, de calidad del servicio y acciones de discriminación, en el marco de la estrategia \"Taxistas en equidad\".","Encuesta diferenciada con enfoque de género de las condiciones de prestación de servicio de taxis en Bogotá aplicada. ",1,"2021-06-01","2021-11-30",1,"En el cuarto trimestre se avanzó en la elaboración del cuestionario a aplicar teniendo en cuenta en la selección de factores, atributos y criterios que perciben los usuarios y usuarias de taxi, teniendo como fuente de información la encuesta aplicada a usuarios en 2020, taller visión del taxi 2021, normas técnicas y legales y un benchamarking detallado. \nTambién se desarrollaron los talleres planteados el trimestre pasado, donde se tuvo un taller con solo conductoras mujeres.\n\nEn el cuestionario se incluyeron preguntas enfocadas a género. Se estructuró la muestra de la encuesta para que el 60% de respuestas sean mujeres. El número esperado de encuestas válidas es de 414.\n\nEl inicio de la encuesta está programado para la semana del 13 al 17 de diciembre","SI",252,162,"El dato de número de mujeres y hombres es lo proyectado para la aplicación de la encuestas el próxima, la cual contiene diferentes variables para su caracterización.","Para la elaboración del cuestionario e incluir preguntas enfocadas en género, se tuvo retroalimentación de la oficina de gestión social","Subdirección de transporte público","Claudia Mercado\nLaura Vásquez Perez",null,"cmercado@movilidad.gov.co\nlvasquez@movilidadbogota.gov.co "]
["11.1 Secretaría Distrital de Movilidad ",{"$f":"IF(C6=0,\" \",IFERROR(VLOOKUP(C6,LibroCódigos!$E$2:$F$2571,2,FALSE),\"ERROR\"))","v":"PSTIG-3-1B"},"Diseñar un plan de acción en el marco de los resultados de la consultoría \"Caracterizar los viajes de cuidado con enfoque diferencial y de género a partir de cartografía etnográfica\"","Plan de acción con caracterización de los viajes de cuidado con enfoque diferencial y de género a partir de cartografía etnográfica diseñado. ",1,"2021-06-01","2021-07-01",null,"Se solicitó en primer trimestre excluir de la concertación por cruce con el plan de acción de la Política.",null,null,null,null,"Desde primer trimestre se solicitó excluir de la concertación por cruce con el plan de acción de la Política en el producto 11.1.9 Estrategia de participación con enfoque de género en el sistema distrital del cuidado. ","Oficina de Gestión Social","Adriana Iza",3103049546,"aiza@movilidad.gov.co"]
{"$rows_left_out":89}
{"sheet":"REPORTES XXXXX","index":5,"n_rows":100,"n_cols":23,"rows_kept":100,"cut":false,"hidden":true,"merged":[]}
["Decreto xxx de 2021"]
["Conpes 014 de 2020"]
["Hacienda"]
["Entidad","Código","Actividades","Indicador","Meta 2021","Fecha inicio","Fecha finalización","Avance meta I Trimestre","Avance meta II Trimestre","Avance meta III Trimestre","Avance meta IV Trimestre","DESCRIPCIÓN AVANCE CUALITATIVO I TRIMESTRE","DESCRIPCIÓN AVANCE CUALITATIVO II TRIMESTRE","DESCRIPCIÓN AVANCE CUALITATIVO III TRIMESTRE","DESCRIPCIÓN AVANCE CUALITATIVO IV TRIMESTRE","¿Se cumplió la actividad?","# Mujeres","# Hombres","Descripción de diversidades y diferencias","Dirección/Subdirección/Grupo/Unidad","Persona de contacto","Teléfono","Correo electrónico"]
[{"$f":"'I TRIMESTRE'!#REF!","v":{"$error":"#REF!"}},{"$f":"IF(C5=0,\" \",IFERROR(VLOOKUP(C5,LibroCódigos!$E$2:$F$2571,2,FALSE),\"ERROR\"))","v":" "}]
[{"$f":"'I TRIMESTRE'!A5","v":"11.1 Secretaría Distrital de Movilidad "},{"$f":"IF(C6=0,\" \",IFERROR(VLOOKUP(C6,LibroCódigos!$E$2:$F$2571,2,FALSE),\"ERROR\"))","v":" "}]
{"$rows_left_out":95}
{"sheet":"Datos","index":6,"n_rows":45,"n_cols":12,"rows_kept":45,"cut":false,"hidden":true,"merged":[]}
["Gestion_Publica",null,null,null,"1.1 Secretaría General",null,null,null,null,null,"PIOEG","SI"]
["Gobierno",null,null,null,"1.2 Departamento Administrativo del Servicio Civil Distrital - DASCD",null,null,null,null,null,"PSTIG","NO"]
["Hacienda",null,null,null,"2.1 Secretaría Distrital de Gobierno"]
["Planeacion",null,null,null,"2.2 Departamento Administrativo de la Defensoría del Espacio Público"]
["DesarrolloEconomico_Industria_Turismo",null,null,null,"2.3 Instituto Distrital de la Participación y Acción Comunal - IDPAC"]
["Educacion",null,null,null,"3.1 Secretaría Distrital de Hacienda"]
{"$rows_left_out":40}
{"sheet":"PSTIG-PIOEG","index":7,"n_rows":133,"n_cols":13,"rows_kept":133,"cut":false,"hidden":true,"merged":[]}
["INSTRUMENTO",null,"PROCESO",null,"DIMENSIÓN",null,"CATEGORÍA","CÓDIGO",null,null,"PROCESO",null,"DIMENSIÓN"]
["PSTIG",1,"APOYO",1,"TALENTO_HUMANO","A","Capacitación, formación y sensibilización para el talento humano sobre los enfoques de género, diferencial y derechos de las mujeres",{"$f":"CONCATENATE(A2,\"-\",B2,\"-\",D2,F2)","v":"PSTIG-1-1A"},null,"PSTIG","APOYO",null,"TALENTO_HUMANO"]
["PSTIG",1,"APOYO",1,"TALENTO_HUMANO","B","Programas de bienestar, seguridad y salud en el trabajo para el talento humano, con los enfoques de género y diferencial.",{"$f":"CONCATENATE(A3,\"-\",B3,\"-\",D3,F3)","v":"PSTIG-1-1B"},null,"PSTIG","ESTRATÉGICO",null,"INFORMACIÓN_Y_COMUNICACIÓN"]
["PSTIG",1,"APOYO",1,"TALENTO_HUMANO","C","Adecuación institucional para el acceso y permanencia del talento humano en el trabajo en condiciones de equidad e igualdad atendiendo los enfoques de género y diferencial.","PSTIG-1-1C",null,"PSTIG","MISIONALES ",null,"GESTIÓN_CON_VALORES_PARA_RESULTADO"]
["PSTIG",1,"APOYO",1,"TALENTO_HUMANO","D","Diseño y puesta en marcha de protocolos desde los enfoques de género y diferencial para la prevención y atención de las violencias contra las mujeres en el ámbito institucional.","PSTIG-1-1D",null,"PSTIG","EVALUACIÓN_Y_SEGUIMIENTO",null,"GESTIÓN_DEL_CONOCIMIENTO_Y_LA_INNOVACIÓN"]
["PSTIG",1,"APOYO",2,"INFORMACIÓN_Y_COMUNICACIÓN","A","Estrategias de comunicación con enfoque de género y diferencial para repensar prácticas, imaginarios, representaciones y estereotipos en el ámbito institucional. ","PSTIG-1-2A",null,null,null,null,"DIRECCIONAMIENTO_ESTRATÉGICO_Y_PLANEACIÓN"]
{"$rows_left_out":127}